Jump to content
Ultimaker Community of 3D Printing Experts
Sign in to follow this  
mhk3000

CuraEngine make Error

Recommended Posts

Hello,

When I am making CuraEngine on my Win7 64 bit, I am getting the following error

$ mingw32-make all

g++ -I. -c -Wall -Wextra -O3 -fomit-frame-pointer main.cpp -o main.o

In file included from main.cpp:34:0:

gcodeExport.h: In member function ‘void GCodeExport::replaceTagInStart(const char*, const char*)’:

gcodeExport.h:65:9: error: ‘off64_t’ was not declared in this scope

off64_t oldPos = ftello64(f);

^

gcodeExport.h:65:17: error: expected ‘;’ before ‘oldPos’

off64_t oldPos = ftello64(f);

^

gcodeExport.h:68:32: error: ‘fseeko64’ was not declared in this scope

fseeko64(f, 0, SEEK_SET);

^

gcodeExport.h:78:21: error: ‘oldPos’ was not declared in this scope

fseeko64(f, oldPos, SEEK_SET);

^

C:mingwinmingw32-make.exe: *** [main.o] Error 1

 

 

any ideas

 

thanks

 

Mohammed

 

Share this post


Link to post
Share on other sites

Create an account or sign in to comment

You need to be a member in order to leave a comment

Create an account

Sign up for a new account in our community. It's easy!

Register a new account

Sign in

Already have an account? Sign in here.

Sign In Now
Sign in to follow this  

×

Important Information

Terms of Use Privacy Policy