Jump to content
Ultimaker Community of 3D Printing Experts
winksaville

Trying to build Cura from source and it failed

Recommended Posts

I cloned cura-build and I did:

 

mkdir buildcd buildcmake ..make

 

The make failed with the following error:

 

lib_CuraEngine.a(Cura.pb.cc.o):(.rodata._ZTVN4cura5proto15SlicingFinishedE[_ZTVN4cura5proto15SlicingFinishedE]+0x20): undefined reference to `google::protobuf::Message::GetTypeName[abi:cxx11]() const'lib_CuraEngine.a(Cura.pb.cc.o):(.rodata._ZTVN4cura5proto15SlicingFinishedE[_ZTVN4cura5proto15SlicingFinishedE]+0x58): undefined reference to `google::protobuf::Message::InitializationErrorString[abi:cxx11]() const'/home/wink/prgs/ultimaker/cura-build/build/inst/lib/libArcus.a(Socket.cpp.o): In function `Arcus::SocketPrivate::sendMessage(std::shared_ptr)':Socket.cpp:(.text+0x1ec7): undefined reference to `google::protobuf::MessageLite::SerializeAsString[abi:cxx11]() const'collect2: error: ld returned 1 exit statusmake[5]: *** [CuraEngine] Error 1CMakeFiles/CuraEngine.dir/build.make:98: recipe for target 'CuraEngine' failedmake[5]: Leaving directory '/home/wink/prgs/ultimaker/cura-build/build/CuraEngine-prefix/src/CuraEngine-build'make[4]: *** [CMakeFiles/CuraEngine.dir/all] Error 2CMakeFiles/Makefile2:68: recipe for target 'CMakeFiles/CuraEngine.dir/all' failedmake[4]: Leaving directory '/home/wink/prgs/ultimaker/cura-build/build/CuraEngine-prefix/src/CuraEngine-build'make[3]: *** [all] Error 2Makefile:149: recipe for target 'all' failedmake[3]: Leaving directory '/home/wink/prgs/ultimaker/cura-build/build/CuraEngine-prefix/src/CuraEngine-build'make[2]: *** [CuraEngine-prefix/src/CuraEngine-stamp/CuraEngine-build] Error 2CMakeFiles/CuraEngine.dir/build.make:111: recipe for target 'CuraEngine-prefix/src/CuraEngine-stamp/CuraEngine-build' failedmake[2]: Leaving directory '/home/wink/prgs/ultimaker/cura-build/build'make[1]: *** [CMakeFiles/CuraEngine.dir/all] Error 2CMakeFiles/Makefile2:181: recipe for target 'CMakeFiles/CuraEngine.dir/all' failedmake[1]: Leaving directory '/home/wink/prgs/ultimaker/cura-build/build'make: *** [all] Error 2Makefile:105: recipe for target 'all' failed

 

Here is a regular log and here is a "make VERBOSE=1" log.

I'm building on an Arch Linux system any suggestions?

-- Wink

Share this post


Link to post
Share on other sites

Create an account or sign in to comment

You need to be a member in order to leave a comment

Create an account

Sign up for a new account in our community. It's easy!

Register a new account

Sign in

Already have an account? Sign in here.

Sign In Now

[[Template core/front/global/_customFooter does not exist. This theme may be out of date. Run the support tool in the AdminCP to restore the default theme.]]
×

Important Information

Welcome to the Ultimaker Community of 3D printing experts. Visit the following links to read more about our Terms of Use or our Privacy Policy. Thank you!